From Will Pittenger, 5 Years ago, written in Plain Text.
Embed
  1. ++ Mark Compile start  : "kauth" "5.7.0" "Tue, 07 Apr 2015 04:41:58 +0000"
  2. -- The C compiler identification is GNU 4.9.2
  3. -- The CXX compiler identification is GNU 4.9.2
  4. -- Check for working C compiler: /var/lib/lunar/compilers/gcc
  5. -- Check for working C compiler: /var/lib/lunar/compilers/gcc -- works
  6. -- Detecting C compiler ABI info
  7. -- Detecting C compiler ABI info - done
  8. -- Detecting C compile features
  9. -- Detecting C compile features - done
  10. -- Check for working CXX compiler: /var/lib/lunar/compilers/g++
  11. -- Check for working CXX compiler: /var/lib/lunar/compilers/g++ -- works
  12. -- Detecting CXX compiler ABI info
  13. -- Detecting CXX compiler ABI info - done
  14. -- Detecting CXX compile features
  15. -- Detecting CXX compile features - done
  16. -- Looking for __GLIBC__
  17. -- Looking for __GLIBC__ - found
  18. -- Performing Test _OFFT_IS_64BIT
  19. -- Performing Test _OFFT_IS_64BIT - Success
  20. -- No backend for KAuth was explicitly specified: probing system to find the best one available
  21. CMake Warning at src/ConfigureChecks.cmake:17 (find_package):
  22.   By not providing "FindPolkitQt5-1.cmake" in CMAKE_MODULE_PATH this project
  23.   has asked CMake to find a package configuration file provided by
  24.   "PolkitQt5-1", but CMake did not find one.
  25.  
  26.   Could not find a package configuration file provided by "PolkitQt5-1"
  27.   (requested version 0.99.0) with any of the following names:
  28.  
  29.     PolkitQt5-1Config.cmake
  30.     polkitqt5-1-config.cmake
  31.  
  32.   Add the installation prefix of "PolkitQt5-1" to CMAKE_PREFIX_PATH or set
  33.   "PolkitQt5-1_DIR" to a directory containing one of the above files.  If
  34.   "PolkitQt5-1" provides a separate development package or SDK, be sure it
  35.   has been installed.
  36. Call Stack (most recent call first):
  37.   src/CMakeLists.txt:5 (include)
  38.  
  39.  
  40. -- Found PkgConfig: /usr/bin/pkg-config (found version "0.28")
  41. -- Could NOT find PolkitQt (missing:  POLKITQT_GUI_LIBRARY POLKITQT_CORE_LIBRARY POLKITQT_INCLUDE_DIR) (Required is at least version "0.9.3")
  42. -- Building Fake KAuth backend
  43. WARNING: No valid KAuth backends will be built. The library will not work properly unless compiled with
  44.              a working backend
  45. -- Performing Test COMPILER_HAS_HIDDEN_VISIBILITY
  46. -- Performing Test COMPILER_HAS_HIDDEN_VISIBILITY - Success
  47. -- Performing Test COMPILER_HAS_HIDDEN_INLINE_VISIBILITY
  48. -- Performing Test COMPILER_HAS_HIDDEN_INLINE_VISIBILITY - Success
  49. -- Performing Test COMPILER_HAS_DEPRECATED_ATTR
  50. -- Performing Test COMPILER_HAS_DEPRECATED_ATTR - Success
  51. --
  52. -- The following OPTIONAL packages have been found:
  53.  
  54.  * PkgConfig
  55.  
  56. -- The following REQUIRED packages have been found:
  57.  
  58.  * ECM (required version >= 1.7.0)
  59.  * Qt5Gui (required version >= 5.4.1)
  60.  * KF5CoreAddons (required version >= 5.7.0)
  61.  * Qt5LinguistTools
  62.  * Qt5Widgets
  63.  * Qt5DBus
  64.  * Qt5 (required version >= 5.2.0)
  65.  * Qt5Core
  66.  
  67. -- The following RECOMMENDED packages have not been found:
  68.  
  69.  * PolkitQt5-1 (required version >= 0.99.0) , PolicyKit API for Qt , <http://techbase.kde.org/Polkit-Qt-1>
  70.    Support for executing priviledged actions in a controlled way (KAuth). Either this or PolkitQt is required to make KAuth work, and hence enable certain workspace functionalities
  71.  * PolkitQt , PolicyKit API for Qt , <http://api.kde.org/polkit-qt>
  72.    Support for executing priviledged actions in a controlled way (KAuth). Either this or PolkitQt5-1 is required to make KAuth work, and hence enable certain workspace functionalities
  73.  
  74. -- Configuring done
  75. -- Generating done
  76. -- Build files have been written to: /usr/src/kauth-5.7.0/kauth-oosb
  77. Scanning dependencies of target translations_1
  78. [  0%] Generating sl/kauth5_qt.qm
  79. [  0%] Built target translations_1
  80. Scanning dependencies of target translations_10
  81. [  1%] Generating sr@ijekavianlatin/kauth5_qt.qm
  82. [  1%] Built target translations_10
  83. Scanning dependencies of target translations_100
  84. [  2%] Generating uz/kauth5_qt.qm
  85. [  2%] Built target translations_100
  86. Scanning dependencies of target translations_11
  87. [  2%] Generating ug/kauth5_qt.qm
  88. [  2%] Built target translations_11
  89. Scanning dependencies of target translations_12
  90. [  3%] Generating cs/kauth5_qt.qm
  91. [  3%] Built target translations_12
  92. Scanning dependencies of target translations_13
  93. [  4%] Generating nb/kauth5_qt.qm
  94. [  4%] Built target translations_13
  95. Scanning dependencies of target translations_14
  96. [  5%] Generating ru/kauth5_qt.qm
  97. [  5%] Built target translations_14
  98. Scanning dependencies of target translations_15
  99. [  5%] Generating wa/kauth5_qt.qm
  100. [  5%] Built target translations_15
  101. Scanning dependencies of target translations_16
  102. [  6%] Generating hu/kauth5_qt.qm
  103. [  6%] Built target translations_16
  104. Scanning dependencies of target translations_17
  105. [  7%] Generating kk/kauth5_qt.qm
  106. [  7%] Built target translations_17
  107. Scanning dependencies of target translations_18
  108. [  7%] Generating it/kauth5_qt.qm
  109. [  7%] Built target translations_18
  110. Scanning dependencies of target translations_19
  111. [  8%] Generating hr/kauth5_qt.qm
  112. [  8%] Built target translations_19
  113. Scanning dependencies of target translations_2
  114. [  9%] Generating lv/kauth5_qt.qm
  115. [  9%] Built target translations_2
  116. Scanning dependencies of target translations_20
  117. [ 10%] Generating kn/kauth5_qt.qm
  118. [ 10%] Built target translations_20
  119. Scanning dependencies of target translations_21
  120. [ 10%] Generating ps/kauth5_qt.qm
  121. [ 10%] Built target translations_21
  122. Scanning dependencies of target translations_22
  123. [ 11%] Generating ha/kauth5_qt.qm
  124. [ 11%] Built target translations_22
  125. Scanning dependencies of target translations_23
  126. [ 12%] Generating sv/kauth5_qt.qm
  127. [ 12%] Built target translations_23
  128. Scanning dependencies of target translations_24
  129. [ 12%] Generating eo/kauth5_qt.qm
  130. [ 12%] Built target translations_24
  131. Scanning dependencies of target translations_25
  132. [ 13%] Generating sr@latin/kauth5_qt.qm
  133. [ 13%] Built target translations_25
  134. Scanning dependencies of target translations_26
  135. [ 14%] Generating nds/kauth5_qt.qm
  136. [ 14%] Built target translations_26
  137. Scanning dependencies of target translations_27
  138. [ 14%] Generating be@latin/kauth5_qt.qm
  139. [ 14%] Built target translations_27
  140. Scanning dependencies of target translations_28
  141. [ 15%] Generating tg/kauth5_qt.qm
  142. [ 15%] Built target translations_28
  143. Scanning dependencies of target translations_29
  144. [ 16%] Generating af/kauth5_qt.qm
  145. [ 16%] Built target translations_29
  146. Scanning dependencies of target translations_3
  147. [ 17%] Generating vi/kauth5_qt.qm
  148. [ 17%] Built target translations_3
  149. Scanning dependencies of target translations_30
  150. [ 17%] Generating ia/kauth5_qt.qm
  151. [ 17%] Built target translations_30
  152. Scanning dependencies of target translations_31
  153. [ 18%] Generating km/kauth5_qt.qm
  154. [ 18%] Built target translations_31
  155. Scanning dependencies of target translations_32
  156. [ 19%] Generating de/kauth5_qt.qm
  157. [ 19%] Built target translations_32
  158. Scanning dependencies of target translations_33
  159. [ 19%] Generating eu/kauth5_qt.qm
  160. [ 19%] Built target translations_33
  161. Scanning dependencies of target translations_34
  162. [ 20%] Generating gd/kauth5_qt.qm
  163. [ 20%] Built target translations_34
  164. Scanning dependencies of target translations_35
  165. [ 21%] Generating pl/kauth5_qt.qm
  166. [ 21%] Built target translations_35
  167. Scanning dependencies of target translations_36
  168. [ 22%] Generating ca/kauth5_qt.qm
  169. [ 22%] Built target translations_36
  170. Scanning dependencies of target translations_37
  171. [ 22%] Generating cy/kauth5_qt.qm
  172. [ 22%] Built target translations_37
  173. Scanning dependencies of target translations_38
  174. [ 23%] Generating pt/kauth5_qt.qm
  175. [ 23%] Built target translations_38
  176. Scanning dependencies of target translations_39
  177. [ 24%] Generating bn/kauth5_qt.qm
  178. [ 24%] Built target translations_39
  179. Scanning dependencies of target translations_4
  180. [ 24%] Generating ca@valencia/kauth5_qt.qm
  181. [ 24%] Built target translations_4
  182. Scanning dependencies of target translations_40
  183. [ 25%] Generating is/kauth5_qt.qm
  184. [ 25%] Built target translations_40
  185. Scanning dependencies of target translations_41
  186. [ 26%] Generating sq/kauth5_qt.qm
  187. [ 26%] Built target translations_41
  188. Scanning dependencies of target translations_42
  189. [ 27%] Generating crh/kauth5_qt.qm
  190. [ 27%] Built target translations_42
  191. Scanning dependencies of target translations_43
  192. [ 27%] Generating se/kauth5_qt.qm
  193. [ 27%] Built target translations_43
  194. Scanning dependencies of target translations_44
  195. [ 28%] Generating hy/kauth5_qt.qm
  196. [ 28%] Built target translations_44
  197. Scanning dependencies of target translations_45
  198. [ 29%] Generating hi/kauth5_qt.qm
  199. [ 29%] Built target translations_45
  200. Scanning dependencies of target translations_46
  201. [ 29%] Generating mr/kauth5_qt.qm
  202. [ 29%] Built target translations_46
  203. Scanning dependencies of target translations_47
  204. [ 30%] Generating si/kauth5_qt.qm
  205. [ 30%] Built target translations_47
  206. Scanning dependencies of target translations_48
  207. [ 31%] Generating bn_IN/kauth5_qt.qm
  208. [ 31%] Built target translations_48
  209. Scanning dependencies of target translations_49
  210. [ 31%] Generating da/kauth5_qt.qm
  211. [ 31%] Built target translations_49
  212. Scanning dependencies of target translations_5
  213. [ 32%] Generating gl/kauth5_qt.qm
  214. [ 32%] Built target translations_5
  215. Scanning dependencies of target translations_50
  216. [ 33%] Generating oc/kauth5_qt.qm
  217. [ 33%] Built target translations_50
  218. Scanning dependencies of target translations_51
  219. [ 34%] Generating sr@ijekavian/kauth5_qt.qm
  220. [ 34%] Built target translations_51
  221. Scanning dependencies of target translations_52
  222. [ 34%] Generating ast/kauth5_qt.qm
  223. [ 34%] Built target translations_52
  224. Scanning dependencies of target translations_53
  225. [ 35%] Generating pt_BR/kauth5_qt.qm
  226. [ 35%] Built target translations_53
  227. Scanning dependencies of target translations_54
  228. [ 36%] Generating et/kauth5_qt.qm
  229. [ 36%] Built target translations_54
  230. Scanning dependencies of target translations_55
  231. [ 36%] Generating id/kauth5_qt.qm
  232. [ 36%] Built target translations_55
  233. Scanning dependencies of target translations_56
  234. [ 37%] Generating hsb/kauth5_qt.qm
  235. [ 37%] Built target translations_56
  236. Scanning dependencies of target translations_57
  237. [ 38%] Generating as/kauth5_qt.qm
  238. [ 38%] Built target translations_57
  239. Scanning dependencies of target translations_58
  240. [ 39%] Generating ja/kauth5_qt.qm
  241. [ 39%] Built target translations_58
  242. Scanning dependencies of target translations_59
  243. [ 39%] Generating mai/kauth5_qt.qm
  244. [ 39%] Built target translations_59
  245. Scanning dependencies of target translations_6
  246. [ 40%] Generating es/kauth5_qt.qm
  247. [ 40%] Built target translations_6
  248. Scanning dependencies of target translations_60
  249. [ 41%] Generating sr/kauth5_qt.qm
  250. [ 41%] Built target translations_60
  251. Scanning dependencies of target translations_61
  252. [ 41%] Generating el/kauth5_qt.qm
  253. [ 41%] Built target translations_61
  254. Scanning dependencies of target translations_62
  255. [ 42%] Generating be/kauth5_qt.qm
  256. [ 42%] Built target translations_62
  257. Scanning dependencies of target translations_63
  258. [ 43%] Generating uk/kauth5_qt.qm
  259. [ 43%] Built target translations_63
  260. Scanning dependencies of target translations_64
  261. [ 44%] Generating lt/kauth5_qt.qm
  262. [ 44%] Built target translations_64
  263. Scanning dependencies of target translations_65
  264. [ 44%] Generating csb/kauth5_qt.qm
  265. [ 44%] Built target translations_65
  266. Scanning dependencies of target translations_66
  267. [ 45%] Generating zh_CN/kauth5_qt.qm
  268. [ 45%] Built target translations_66
  269. Scanning dependencies of target translations_67
  270. [ 46%] Generating fi/kauth5_qt.qm
  271. [ 46%] Built target translations_67
  272. Scanning dependencies of target translations_68
  273. [ 46%] Generating mk/kauth5_qt.qm
  274. [ 46%] Built target translations_68
  275. Scanning dependencies of target translations_69
  276. [ 47%] Generating ku/kauth5_qt.qm
  277. [ 47%] Built target translations_69
  278. Scanning dependencies of target translations_7
  279. [ 48%] Generating ms/kauth5_qt.qm
  280. [ 48%] Built target translations_7
  281. Scanning dependencies of target translations_70
  282. [ 49%] Generating pa/kauth5_qt.qm
  283. [ 49%] Built target translations_70
  284. Scanning dependencies of target translations_71
  285. [ 49%] Generating ar/kauth5_qt.qm
  286. [ 49%] Built target translations_71
  287. Scanning dependencies of target translations_72
  288. [ 50%] Generating xh/kauth5_qt.qm
  289. [ 50%] Built target translations_72
  290. Scanning dependencies of target translations_73
  291. [ 51%] Generating br/kauth5_qt.qm
  292. [ 51%] Built target translations_73
  293. Scanning dependencies of target translations_74
  294. [ 51%] Generating nn/kauth5_qt.qm
  295. [ 51%] Built target translations_74
  296. Scanning dependencies of target translations_75
  297. [ 52%] Generating sk/kauth5_qt.qm
  298. [ 52%] Built target translations_75
  299. Scanning dependencies of target translations_76
  300. [ 53%] Generating fr/kauth5_qt.qm
  301. [ 53%] Built target translations_76
  302. Scanning dependencies of target translations_77
  303. [ 53%] Generating th/kauth5_qt.qm
  304. [ 53%] Built target translations_77
  305. Scanning dependencies of target translations_78
  306. [ 54%] Generating tt/kauth5_qt.qm
  307. [ 54%] Built target translations_78
  308. Scanning dependencies of target translations_79
  309. [ 55%] Generating zh_TW/kauth5_qt.qm
  310. [ 55%] Built target translations_79
  311. Scanning dependencies of target translations_8
  312. [ 56%] Generating en_GB/kauth5_qt.qm
  313. [ 56%] Built target translations_8
  314. Scanning dependencies of target translations_80
  315. [ 56%] Generating ka/kauth5_qt.qm
  316. [ 56%] Built target translations_80
  317. Scanning dependencies of target translations_81
  318. [ 57%] Generating or/kauth5_qt.qm
  319. [ 57%] Built target translations_81
  320. Scanning dependencies of target translations_82
  321. [ 58%] Generating ro/kauth5_qt.qm
  322. [ 58%] Built target translations_82
  323. Scanning dependencies of target translations_83
  324. [ 58%] Generating ko/kauth5_qt.qm
  325. [ 58%] Built target translations_83
  326. Scanning dependencies of target translations_84
  327. [ 59%] Generating uz@cyrillic/kauth5_qt.qm
  328. [ 59%] Built target translations_84
  329. Scanning dependencies of target translations_85
  330. [ 60%] Generating fa/kauth5_qt.qm
  331. [ 60%] Built target translations_85
  332. Scanning dependencies of target translations_86
  333. [ 61%] Generating bg/kauth5_qt.qm
  334. [ 61%] Built target translations_86
  335. Scanning dependencies of target translations_87
  336. [ 61%] Generating zh_HK/kauth5_qt.qm
  337. [ 61%] Built target translations_87
  338. Scanning dependencies of target translations_88
  339. [ 62%] Generating he/kauth5_qt.qm
  340. [ 62%] Built target translations_88
  341. Scanning dependencies of target translations_89
  342. [ 63%] Generating fy/kauth5_qt.qm
  343. [ 63%] Built target translations_89
  344. Scanning dependencies of target translations_9
  345. [ 63%] Generating ga/kauth5_qt.qm
  346. [ 63%] Built target translations_9
  347. Scanning dependencies of target translations_90
  348. [ 64%] Generating nl/kauth5_qt.qm
  349. [ 64%] Built target translations_90
  350. Scanning dependencies of target translations_91
  351. [ 65%] Generating ne/kauth5_qt.qm
  352. [ 65%] Built target translations_91
  353. Scanning dependencies of target translations_92
  354. [ 66%] Generating lb/kauth5_qt.qm
  355. [ 66%] Built target translations_92
  356. Scanning dependencies of target translations_93
  357. [ 66%] Generating te/kauth5_qt.qm
  358. [ 66%] Built target translations_93
  359. Scanning dependencies of target translations_94
  360. [ 67%] Generating ta/kauth5_qt.qm
  361. [ 67%] Built target translations_94
  362. Scanning dependencies of target translations_95
  363. [ 68%] Generating hne/kauth5_qt.qm
  364. [ 68%] Built target translations_95
  365. Scanning dependencies of target translations_96
  366. [ 68%] Generating tr/kauth5_qt.qm
  367. [ 68%] Built target translations_96
  368. Scanning dependencies of target translations_97
  369. [ 69%] Generating bs/kauth5_qt.qm
  370. [ 69%] Built target translations_97
  371. Scanning dependencies of target translations_98
  372. [ 70%] Generating gu/kauth5_qt.qm
  373. [ 70%] Built target translations_98
  374. Scanning dependencies of target translations_99
  375. [ 71%] Generating ml/kauth5_qt.qm
  376. [ 71%] Built target translations_99
  377. Scanning dependencies of target KF5Auth_automoc
  378. [ 72%] Automatic moc for target KF5Auth
  379. Generating moc_HelperProxy.cpp
  380. Generating moc_kauthexecutejob.cpp
  381. Generating moc_kauthobjectdecorator.cpp
  382. Generating moc_AuthBackend.cpp
  383. Generating moc_FakeBackend.cpp
  384. Generating moc_FakeHelperProxy.cpp
  385. Generating moc_kauthactionreply.cpp
  386. /usr/src/kauth-5.7.0/src/kauthactionreply.h:0: Note: No relevant classes found. No output generated.
  387. [ 72%] Built target KF5Auth_automoc
  388. Scanning dependencies of target KF5Auth
  389. [ 73%] Building CXX object src/CMakeFiles/KF5Auth.dir/kauthaction.cpp.o
  390. [ 74%] Building CXX object src/CMakeFiles/KF5Auth.dir/kauthactionreply.cpp.o
  391. [ 75%] Building CXX object src/CMakeFiles/KF5Auth.dir/kauthexecutejob.cpp.o
  392. [ 75%] Building CXX object src/CMakeFiles/KF5Auth.dir/kauthobjectdecorator.cpp.o
  393. [ 76%] Building CXX object src/CMakeFiles/KF5Auth.dir/AuthBackend.cpp.o
  394. [ 77%] Building CXX object src/CMakeFiles/KF5Auth.dir/BackendsManager.cpp.o
  395. [ 77%] Building CXX object src/CMakeFiles/KF5Auth.dir/HelperProxy.cpp.o
  396. [ 78%] Building CXX object src/CMakeFiles/KF5Auth.dir/kauthhelpersupport.cpp.o
  397. [ 79%] Building CXX object src/CMakeFiles/KF5Auth.dir/backends/fake/FakeBackend.cpp.o
  398. [ 80%] Building CXX object src/CMakeFiles/KF5Auth.dir/backends/fakehelper/FakeHelperProxy.cpp.o
  399. [ 80%] Building CXX object src/CMakeFiles/KF5Auth.dir/ECMQmLoader.cpp.o
  400. [ 81%] Building CXX object src/CMakeFiles/KF5Auth.dir/KF5Auth_automoc.cpp.o
  401. Linking CXX shared library libKF5Auth.so
  402. [ 81%] Built target KF5Auth
  403. Scanning dependencies of target kauth_helper_plugin_automoc
  404. [ 82%] Automatic moc for target kauth_helper_plugin
  405. Generating moc_HelperProxy.cpp
  406. Generating moc_DBusHelperProxy.cpp
  407. [ 82%] Built target kauth_helper_plugin_automoc
  408. [ 83%] Generating kf5authadaptor.cpp, kf5authadaptor.h
  409. [ 83%] Generating kf5authadaptor.moc
  410. Scanning dependencies of target kauth_helper_plugin
  411. [ 84%] Building CXX object src/CMakeFiles/kauth_helper_plugin.dir/backends/dbus/DBusHelperProxy.cpp.o
  412. ++ Mark Compile stop   : "kauth" "5.7.0" "Tue, 07 Apr 2015 04:42:08 +0000"
  413. In file included from /usr/src/kauth-5.7.0/src/backends/dbus/DBusHelperProxy.cpp:21:0:
  414. /usr/src/kauth-5.7.0/src/backends/dbus/DBusHelperProxy.h:44:5: error: 'QDBusConnection' does not name a type
  415.      QDBusConnection m_busConnection;
  416.      ^
  417. /usr/src/kauth-5.7.0/src/backends/dbus/DBusHelperProxy.h:56:27: error: 'QDBusConnection' does not name a type
  418.      DBusHelperProxy(const QDBusConnection &busConnection);
  419.                            ^
  420. In file included from /usr/src/kauth-5.7.0/src/backends/dbus/DBusHelperProxy.cpp:32:0:
  421. /usr/src/kauth-5.7.0/kauth-oosb/src/kf5authadaptor.h:31:1: error: expected class-name before '{' token
  422.  {
  423.  ^
  424. In file included from /usr/src/kauth-5.7.0/src/backends/dbus/DBusHelperProxy.cpp:32:0:
  425. /usr/src/kauth-5.7.0/kauth-oosb/src/kf5authadaptor.h: In member function 'KAuth::DBusHelperProxy* Kf5authAdaptor::parent() const':
  426. /usr/src/kauth-5.7.0/kauth-oosb/src/kf5authadaptor.h:63:68: error: cannot call member function 'QObject* QObject::parent() const' without object
  427.      { return static_cast<KAuth::DBusHelperProxy *>(QObject::parent()); }
  428.                                                                     ^
  429. /usr/src/kauth-5.7.0/src/backends/dbus/DBusHelperProxy.cpp: In constructor 'KAuth::DBusHelperProxy::DBusHelperProxy()':
  430. /usr/src/kauth-5.7.0/src/backends/dbus/DBusHelperProxy.cpp:42:7: error: class 'KAuth::DBusHelperProxy' does not have any field named 'm_busConnection'
  431.      , m_busConnection(QDBusConnection::systemBus())
  432.        ^
  433. /usr/src/kauth-5.7.0/src/backends/dbus/DBusHelperProxy.cpp:42:23: error: 'QDBusConnection' has not been declared
  434.      , m_busConnection(QDBusConnection::systemBus())
  435.                        ^
  436. /usr/src/kauth-5.7.0/src/backends/dbus/DBusHelperProxy.cpp: At global scope:
  437. /usr/src/kauth-5.7.0/src/backends/dbus/DBusHelperProxy.cpp:46:40: error: 'QDBusConnection' does not name a type
  438.  DBusHelperProxy::DBusHelperProxy(const QDBusConnection &busConnection)
  439.                                         ^
  440. /usr/src/kauth-5.7.0/src/backends/dbus/DBusHelperProxy.cpp: In constructor 'KAuth::DBusHelperProxy::DBusHelperProxy(const int&)':
  441. /usr/src/kauth-5.7.0/src/backends/dbus/DBusHelperProxy.cpp:49:7: error: class 'KAuth::DBusHelperProxy' does not have any field named 'm_busConnection'
  442.      , m_busConnection(busConnection)
  443.        ^
  444. /usr/src/kauth-5.7.0/src/backends/dbus/DBusHelperProxy.cpp: In member function 'virtual void KAuth::DBusHelperProxy::stopAction(const QString&, const QString&)':
  445. /usr/src/kauth-5.7.0/src/backends/dbus/DBusHelperProxy.cpp:59:5: error: 'QDBusMessage' was not declared in this scope
  446.      QDBusMessage message;
  447.      ^
  448. /usr/src/kauth-5.7.0/src/backends/dbus/DBusHelperProxy.cpp:60:5: error: 'message' was not declared in this scope
  449.      message = QDBusMessage::createMethodCall(helperID, QLatin1String("/"), QLatin1String("org.kde.kf5auth"), QLatin1String("stopAction"));
  450.      ^
  451. /usr/src/kauth-5.7.0/src/backends/dbus/DBusHelperProxy.cpp:60:15: error: 'QDBusMessage' is not a class, namespace, or enumeration
  452.      message = QDBusMessage::createMethodCall(helperID, QLatin1String("/"), QLatin1String("org.kde.kf5auth"), QLatin1String("stopAction"));
  453.                ^
  454. /usr/src/kauth-5.7.0/src/backends/dbus/DBusHelperProxy.cpp:66:5: error: 'm_busConnection' was not declared in this scope
  455.      m_busConnection.asyncCall(message);
  456.      ^
  457. /usr/src/kauth-5.7.0/src/backends/dbus/DBusHelperProxy.cpp: In member function 'virtual void KAuth::DBusHelperProxy::executeAction(const QString&, const QString&, const QVariantMap&)':
  458. /usr/src/kauth-5.7.0/src/backends/dbus/DBusHelperProxy.cpp:76:5: error: 'm_busConnection' was not declared in this scope
  459.      m_busConnection.interface()->startService(helperID);
  460.      ^
  461. /usr/src/kauth-5.7.0/src/backends/dbus/DBusHelperProxy.cpp:85:5: error: 'QDBusMessage' was not declared in this scope
  462.      QDBusMessage message;
  463.      ^
  464. /usr/src/kauth-5.7.0/src/backends/dbus/DBusHelperProxy.cpp:86:5: error: 'message' was not declared in this scope
  465.      message = QDBusMessage::createMethodCall(helperID, QLatin1String("/"), QLatin1String("org.kde.kf5auth"), QLatin1String("performAction"));
  466.      ^
  467. /usr/src/kauth-5.7.0/src/backends/dbus/DBusHelperProxy.cpp:86:15: error: 'QDBusMessage' is not a class, namespace, or enumeration
  468.      message = QDBusMessage::createMethodCall(helperID, QLatin1String("/"), QLatin1String("org.kde.kf5auth"), QLatin1String("performAction"));
  469.                ^
  470. /usr/src/kauth-5.7.0/src/backends/dbus/DBusHelperProxy.cpp:94:5: error: 'QDBusPendingCall' was not declared in this scope
  471.      QDBusPendingCall pendingCall = m_busConnection.asyncCall(message);
  472.      ^
  473. /usr/src/kauth-5.7.0/src/backends/dbus/DBusHelperProxy.cpp:96:9: error: 'pendingCall' was not declared in this scope
  474.      if (pendingCall.reply().type() == QDBusMessage::ErrorMessage) {
  475.          ^
  476. /usr/src/kauth-5.7.0/src/backends/dbus/DBusHelperProxy.cpp:96:39: error: 'QDBusMessage' is not a class, namespace, or enumeration
  477.      if (pendingCall.reply().type() == QDBusMessage::ErrorMessage) {
  478.                                        ^
  479. /usr/src/kauth-5.7.0/src/backends/dbus/DBusHelperProxy.cpp: In member function 'virtual KAuth::Action::AuthStatus KAuth::DBusHelperProxy::authorizeAction(const QString&, const QString&)':
  480. /usr/src/kauth-5.7.0/src/backends/dbus/DBusHelperProxy.cpp:112:5: error: 'm_busConnection' was not declared in this scope
  481.      m_busConnection.interface()->startService(helperID);
  482.      ^
  483. /usr/src/kauth-5.7.0/src/backends/dbus/DBusHelperProxy.cpp:114:5: error: 'QDBusMessage' was not declared in this scope
  484.      QDBusMessage message;
  485.      ^
  486. /usr/src/kauth-5.7.0/src/backends/dbus/DBusHelperProxy.cpp:115:5: error: 'message' was not declared in this scope
  487.      message = QDBusMessage::createMethodCall(helperID, QLatin1String("/"), QLatin1String("org.kde.kf5auth"), QLatin1String("authorizeAction"));
  488.      ^
  489. /usr/src/kauth-5.7.0/src/backends/dbus/DBusHelperProxy.cpp:115:15: error: 'QDBusMessage' is not a class, namespace, or enumeration
  490.      message = QDBusMessage::createMethodCall(helperID, QLatin1String("/"), QLatin1String("org.kde.kf5auth"), QLatin1String("authorizeAction"));
  491.                ^
  492. /usr/src/kauth-5.7.0/src/backends/dbus/DBusHelperProxy.cpp:124:5: error: 'QDBusPendingCall' was not declared in this scope
  493.      QDBusPendingCall pendingCall = m_busConnection.asyncCall(message);
  494.      ^
  495. /usr/src/kauth-5.7.0/src/backends/dbus/DBusHelperProxy.cpp:125:5: error: 'QDBusPendingCallWatcher' was not declared in this scope
  496.      QDBusPendingCallWatcher watcher(pendingCall, this);
  497.      ^
  498. /usr/src/kauth-5.7.0/src/backends/dbus/DBusHelperProxy.cpp:126:14: error: 'watcher' was not declared in this scope
  499.      connect(&watcher, SIGNAL(finished(QDBusPendingCallWatcher*)), &e, SLOT(quit()));
  500.               ^
  501. /usr/src/kauth-5.7.0/src/backends/dbus/DBusHelperProxy.cpp:131:18: error: expected ';' before 'reply'
  502.      QDBusMessage reply = pendingCall.reply();
  503.                   ^
  504. /usr/src/kauth-5.7.0/src/backends/dbus/DBusHelperProxy.cpp:133:9: error: 'reply' was not declared in this scope
  505.      if (reply.type() == QDBusMessage::ErrorMessage || reply.arguments().size() != 1) {
  506.          ^
  507. /usr/src/kauth-5.7.0/src/backends/dbus/DBusHelperProxy.cpp:133:25: error: 'QDBusMessage' is not a class, namespace, or enumeration
  508.      if (reply.type() == QDBusMessage::ErrorMessage || reply.arguments().size() != 1) {
  509.                          ^
  510. /usr/src/kauth-5.7.0/src/backends/dbus/DBusHelperProxy.cpp:137:44: error: 'reply' was not declared in this scope
  511.      return static_cast<Action::AuthStatus>(reply.arguments().first().toUInt());
  512.                                             ^
  513. /usr/src/kauth-5.7.0/src/backends/dbus/DBusHelperProxy.cpp: In member function 'virtual bool KAuth::DBusHelperProxy::initHelper(const QString&)':
  514. /usr/src/kauth-5.7.0/src/backends/dbus/DBusHelperProxy.cpp:144:10: error: 'm_busConnection' was not declared in this scope
  515.      if (!m_busConnection.registerService(name)) {
  516.           ^
  517. /usr/src/kauth-5.7.0/src/backends/dbus/DBusHelperProxy.cpp:148:10: error: 'm_busConnection' was not declared in this scope
  518.      if (!m_busConnection.registerObject(QLatin1String("/"), this)) {
  519.           ^
  520. /usr/src/kauth-5.7.0/src/backends/dbus/DBusHelperProxy.cpp: In member function 'virtual KAuth::Action::AuthStatus KAuth::DBusHelperProxy::authorizeAction(const QString&, const QString&)':
  521. /usr/src/kauth-5.7.0/src/backends/dbus/DBusHelperProxy.cpp:138:1: error: control reaches end of non-void function [-Werror=return-type]
  522.  }
  523.  ^
  524. cc1plus: some warnings being treated as errors
  525. src/CMakeFiles/kauth_helper_plugin.dir/build.make:67: recipe for target 'src/CMakeFiles/kauth_helper_plugin.dir/backends/dbus/DBusHelperProxy.cpp.o' failed
  526. make[2]: *** [src/CMakeFiles/kauth_helper_plugin.dir/backends/dbus/DBusHelperProxy.cpp.o] Error 1
  527. CMakeFiles/Makefile2:3807: recipe for target 'src/CMakeFiles/kauth_helper_plugin.dir/all' failed
  528. make[1]: *** [src/CMakeFiles/kauth_helper_plugin.dir/all] Error 2
  529. Makefile:126: recipe for target 'all' failed
  530. make: *** [all] Error 2